Problem trying to build with xTimeComposer

Technical questions regarding the xTIMEcomposer, xSOFTip Explorer and Programming with XMOS.
bafiogino
Newbie
Posts: 1
Joined: Fri Jan 03, 2020 3:26 pm

Problem trying to build with xTimeComposer

Postby bafiogino » Fri Jan 03, 2020 3:53 pm

Hi guys,

I installed xTimeComposer 14.4.1 and 32 bit JRE on Window 7 64bit.
When I try to clean all projects an error occurred:

Code: Select all

xmake clean 
xmake[1]: *** [clean_common] Error 1
xmake: *** [clean_common] Error 2
The same behavior when I try to build the project:

Code: Select all

xmake 
xmake[1]: *** [check_modules_msg] Error 1
xmake: *** [check_modules_msg] Error 2

From the command line I have the same error:

Code: Select all

>xmake clean
"Cleaning C:/Users/Sviluppo/xTime_Projects/app_usb_aud_xk_216"
cmd /c if exist ".\bin\" RMDIR /S /Q ".\bin\"
cmd /c if exist ".build" RMDIR /S /Q ".build"
But the ".build" folder is not deleted

Code: Select all

>xmake
Checking build modules
Using build modules: module_usb_shared module_xud module_usb_audio module_spdif_tx module_dfu module_usb_device module_locks lib_xassert lib_logging lib_spi lib_i2c
Analyzing devicehost.cpp
"C:\Progra~2\XMOS\xTIMEcomposer\Community_14.4.1\build\xcommon\module_xcommon/build/mkdir.bat"  ......
xcc2clang.exe: error: no such file or directory: '@_iflag.rsp'
xmake[1]: *** [check_modules_msg] Error 1
xmake: *** [check_modules_msg] Error 2
On Mac and on the other Windows 7 32bit pc everything works fine.

Anyone have any suggestions?

Many thanks!

Who is online

Users browsing this forum: No registered users and 1 guest